2,5-dichlorohexane

Kovats' RI, polar column, isothermal

View large format table.

Column type Active phase Temperature (C) I Reference Comment
CapillaryPEG-20M90.1333.Morishita, Terashima, et al., 1983He; Column length: 75. m; Column diameter: 0.25 mm
CapillaryPEG-20M90.1351.Morishita, Terashima, et al., 1983He; Column length: 75. m; Column diameter: 0.25 mm

References

Morishita, Terashima, et al., 1983
Morishita, F.; Terashima, Y.; Ichise, M.; Kojima, T., Prediction of retention indices from molecular structures of chlorinated alkanes, J. Chromatogr. Sci., 1983, 21, 5, 209-213, https://doi.org/10.1093/chromsci/21.5.209 . [all data]