Methyl α-D-glucopyranose, 3,4-bis-O-pentyloxymethyl ether, TMS
- Formula: C25H54O8Si2
- Molecular weight: 538.8625
- IUPAC Standard InChIKey: ZIRJOBRTBQOHGE-ARXROMJUSA-N
- Chemical structure:
View 3d structure (requires JavaScript / HTML 5) - Permanent link for this species. Use this link for bookmarking this species for future reference.

Normal alkane RI, non-polar column, temperature ramp

Column type | Active phase | I | Reference | Comment |
---|---|---|---|---|
Packed | SE-30 | 2515. | Staniewski and Szymanowski, 1982 | He, Gas-Chrom Q, 2. K/min; Column length: 2. m; Tstart: 180. C; Tend: 260. C |

References

Staniewski and Szymanowski, 1982
Staniewski, J.; Szymanowski, J.,
Gas chromatographic determination of some methyl α-D-glucopyranoside pentyloxymethyl ethers,
J. Chromatogr., 1982, 240, 2, 522-525, https://doi.org/10.1016/S0021-9673(00)99635-3
. [all data]