Zonarene

Van Den Dool and Kratz RI, non-polar column, temperature ramp

Data compiled by: NIST Mass Spectrometry Data Center, William E. Wallace, director

Column type CapillaryCapillary
Active phase HP-5CP Sil 5 CB
Column length (m) 30.50.
Carrier gas HeHe
Substrate
Column diameter (mm) 0.250.32
Phase thickness (μm) 0.250.4
Tstart (C) 40.60.
Tend (C) 250.280.
Heat rate (K/min) 5.3.
Initial hold (min) 1.10.
Final hold (min) 10.60.
I 1527.1518.
ReferenceBenzo, Gilardoni, et al., 2007Pino, Marbot, et al., 2002
Comment MSDC-RI MSDC-RI

Normal alkane RI, non-polar column, custom temperature program

Data compiled by: NIST Mass Spectrometry Data Center, William E. Wallace, director

Column type Capillary
Active phase DB-5
Column length (m) 30.
Carrier gas He
Substrate
Column diameter (mm) 0.25
Phase thickness (μm) 0.25
Program 50C(1min) => 3C/min => 250C(10min) => 20C/min => 280C (5min)
I 1520.
ReferenceParker, Pollnitz, et al., 2007
Comment MSDC-RI

References

Benzo, Gilardoni, et al., 2007
Benzo, M.; Gilardoni, G.; Gandini, C.; Caccialanza, G.; Finzi, P.V.; Vidari, G.; Abdo, S.; Layedra, P., Determination of the threshold odor concentration of main odorants in essential oils using gas chromatography-olfactometry incremental dilution technique, J. Chromatogr. A, 2007, 1150, 1-2, 131-135, https://doi.org/10.1016/j.chroma.2007.02.031 . [all data]

Pino, Marbot, et al., 2002
Pino, J.A.; Marbot, R.; Vázquez, C., Characterization of volatile in Cosa Rican Guava [Psidium friedrichsthalianum (Berg) Niedenzu] fruit, J. Agric. Food Chem., 2002, 50, 21, 6023-6026, https://doi.org/10.1021/jf011456i . [all data]