Pinocampheol
- Formula: C10H18O
- Molecular weight: 154.2493
- IUPAC Standard InChIKey: REPVLJRCJUVQFA-KRTGUUSXSA-N
- Chemical structure:
View 3d structure (requires JavaScript / HTML 5) - Stereoisomers:

Van Den Dool and Kratz RI, non-polar column, temperature ramp

Column type | Active phase | I | Reference | Comment |
---|---|---|---|---|
Capillary | SE-54 | 1167. | Simionatto, Porto, et al., 2005 | 25. m/0.25 mm/0.2 μm, H2, 4. K/min; Tstart: 50. C; Tend: 250. C |

Normal alkane RI, non-polar column, temperature ramp

Column type | Active phase | I | Reference | Comment |
---|---|---|---|---|
Capillary | DB-5 | 1173. | Zoghbi, Andrade, et al., 2002 | 30. m/0.25 mm/0.25 μm, He, 3. K/min; Tstart: 60. C; Tend: 240. C |

Normal alkane RI, non-polar column, custom temperature program

Column type | Active phase | I | Reference | Comment |
---|---|---|---|---|
Capillary | HP-5 MS | 1170. | Sharififar, Mozaffarian, et al., 2007 | 30. m/0.25 mm/0.25 μm, Helium; Program: not specified |
Capillary | BPX-5 | 1170. | Judzentiene and Mockute, 2005 | 30. m/0.25 mm/0.25 μm; Program: 60C(0.2min) => 3K/min => 186C => 10C/min => 240C (5min) |
Capillary | SE-30 | 1140. | Vinogradov, 2004 | Program: not specified |
Capillary | SE-30 | 1180. | Vinogradov, 2004 | Program: not specified |
Capillary | CP Sil 8 CB | 1170. | Mockute and Judzentiene, 2003 | 50. m/0.32 mm/0.25 μm, He; Program: 70C(5min) => 3C/min => 100C (1min) => 25C/min => 250C (10min) |
Capillary | Polydimethyl siloxanes | 1140. | Zenkevich, 1997 | Program: not specified |

References

Simionatto, Porto, et al., 2005
Simionatto, E.; Porto, C.; da Silva, U.F.; Squizani, A.; Dalcol, I.I.; Morel, A.F.,
Composition and antimicrobial activity of the essential oil from Aloysia sellowii,
J. Braz. Chem. Soc., 2005, 16, 6B, 1458-1462, https://doi.org/10.1590/S0103-50532005000800028
. [all data]
Zoghbi, Andrade, et al., 2002
Zoghbi, M.G.B.; Andrade, E.H.A.; da Silva, M.H.; Maia, J.G.S.; Luz, A.I.R.; da Silva, J.D.,
Chemical variation in the essential oils of Hyptis crenata Pohl ex Benth.,
Flavour Fragr. J., 2002, 17, 1, 5-8, https://doi.org/10.1002/ffj.1031
. [all data]
Sharififar, Mozaffarian, et al., 2007
Sharififar, F.; Mozaffarian, V.; Moradkhani, S.,
Comparison of antioxidant and free radical scavenging activities of the essential oils from flowers and fruits of Otostegia persica Boiss.,
Pakistan J. Biol. Sci., 2007, 10, 21, 3895-3899, https://doi.org/10.3923/pjbs.2007.3895.3899
. [all data]
Judzentiene and Mockute, 2005
Judzentiene, A.; Mockute, D.,
The inflorescence and leaf essential oils of Tanacetum vulgare L. var. vulgare growing wild in Lithuania,
Biochem. Syst. Ecol., 2005, 33, 5, 487-498, https://doi.org/10.1016/j.bse.2004.11.003
. [all data]
Vinogradov, 2004
Vinogradov, B.A.,
Production, composition, properties and application of essential oils, 2004, retrieved from http://viness.narod.ru. [all data]
Mockute and Judzentiene, 2003
Mockute, D.; Judzentiene, A.,
The myrtenol chemotype of essential oil of Tanacetum vulgare L. var. vulgare (tansy) growing wild in the Vilnius region,
Chemija, 2003, 14, 2, 103-107. [all data]
Zenkevich, 1997
Zenkevich, I.G.,
Analytical Parameters of Components of Essential Oils for their Chromatographic and Chromato-Spectral Identificaiton. Oxsigenated derivatives of Mono- and Sesquiterpene Hydrocarbons,
Rastit, Resursy (Rus.), 1997, 33, 1, 16-28. [all data]