1,trans-7-nonadiene
- Formula: C9H16
- Molecular weight: 124.2233
- IUPAC Standard InChIKey: POZQPLMVTQPOTQ-GQCTYLIASA-N
- Chemical structure:
View 3d structure (requires JavaScript / HTML 5) - Stereoisomers:
- Other names: (E)-1,7-Nonadiene

Kovats' RI, non-polar column, isothermal

Column type | Active phase | Temperature (C) | I | Reference | Comment |
---|---|---|---|---|---|
Capillary | Squalane | 70. | 879.1 | Soják, Král'ovicová, et al., 1984 | 195. m/0.25 mm/0.08 μm, H2 |

Normal alkane RI, non-polar column, isothermal

Column type | Active phase | Temperature (C) | I | Reference | Comment |
---|---|---|---|---|---|
Capillary | Squalane | 70. | 880. | Schomburg, 1966 |

References

Soják, Král'ovicová, et al., 1984
Soják, L.; Král'ovicová, E.; Ostrovský, I.; Leclercq, P.A.,
Retention behaviour of conjegated and isolated n-alkadienes. Identification of n-nona- and n-decadiens by capillary gas chromatography using structure-retention correlations and mass spectrometry,
J. Chromatogr., 1984, 292, 1, 241-261, https://doi.org/10.1016/S0021-9673(01)96207-7
. [all data]
Schomburg, 1966
Schomburg, G.,
Gaschromatographische Retentionsdaten und Struktur Chemischer Verbindungen. II. Methylverzweigungen und Doppelbindungen in Offenkettigen Kohlenwasserstoffen,
J. Chromatogr., 1966, 23, 1-17, https://doi.org/10.1016/S0021-9673(01)98652-2
. [all data]