Cubebol II

Normal alkane RI, non-polar column, temperature ramp

View large format table.

Column type Active phase I Reference Comment
CapillaryOV-1011518.Menut, Bessière, et al., 2002He, 5. K/min; Column length: 25. m; Column diameter: 0.32 mm; Tstart: 50. C; Tend: 200. C

References

Menut, Bessière, et al., 2002
Menut, C.; Bessière, J.M.; Hassani, M.S.; Buchbauer, G.; Schopper, B., Chemical and biological studies of Ocotea comoriensis bark essential oil, Flavour Fragr. J., 2002, 17, 6, 459-461, https://doi.org/10.1002/ffj.1130 . [all data]