3-Decen-1-ol
- Formula: C10H20O
- Molecular weight: 156.2652
- IUPAC Standard InChIKey: MTIJDFJGPCJFKE-UHFFFAOYSA-N
- Chemical structure:
View 3d structure (requires JavaScript / HTML 5) - Stereoisomers:

Van Den Dool and Kratz RI, non-polar column, temperature ramp

Column type | Active phase | I | Reference | Comment |
---|---|---|---|---|
Capillary | SPB-1 | 1235. | Cavaleiro, Salgueiro, et al., 2002 | 30. m/0.20 mm/0.20 μm, He, 3. K/min, 220. C @ 15. min; Tstart: 70. C |

References

Cavaleiro, Salgueiro, et al., 2002
Cavaleiro, C.; Salgueiro, L.R.; Antunes, T.; Sevinate-Pinto, I.; Barroso, J.G.,
Composition of the essential oil and micromorphology of trichomes of Teucrium salviastrum, an endemic species from Portugal,
Flavour Fragr. J., 2002, 17, 4, 287-291, https://doi.org/10.1002/ffj.1068
. [all data]