5-hexenyl-cyclopropane
- Formula: C9H16
- Molecular weight: 124.2233
- IUPAC Standard InChIKey: NGWWCTFUAWVMRV-UHFFFAOYSA-N
- Chemical structure:
View 3d structure (requires JavaScript / HTML 5) - Other names: Cyclopropane, 5-hexenyl

Kovats' RI, non-polar column, isothermal

Column type | Active phase | Temperature (C) | I | Reference | Comment |
---|---|---|---|---|---|
Capillary | Squalane | 80. | 895.34 | Schomburg and Dielmann, 1973 | Column length: 100. m; Column diameter: 0.25 mm |
Capillary | Squalane | 100. | 897.4 | Schomburg and Dielmann, 1973, 2 | Column length: 100. m; Column diameter: 0.25 mm |
Capillary | Squalane | 120. | 899.5 | Schomburg and Dielmann, 1973, 2 | Column length: 100. m; Column diameter: 0.25 mm |
Capillary | Squalane | 60. | 893.7 | Schomburg and Dielmann, 1973, 2 | Column length: 100. m; Column diameter: 0.25 mm |
Capillary | Squalane | 80. | 895.2 | Schomburg and Dielmann, 1973, 2 | Column length: 100. m; Column diameter: 0.25 mm |
Capillary | Squalane | 80. | 895.34 | Schomburg and Dielmann, 1973, 2 | Column length: 100. m; Column diameter: 0.25 mm |

Normal alkane RI, non-polar column, isothermal

Column type | Active phase | Temperature (C) | I | Reference | Comment |
---|---|---|---|---|---|
Capillary | Squalane | 70. | 897. | Schomburg, 1966 |

References

Schomburg and Dielmann, 1973
Schomburg, G.; Dielmann, G.,
Identification by means of retention parameters,
J. Chromatogr. Sci., 1973, 11, 3, 151-159, https://doi.org/10.1093/chromsci/11.3.151
. [all data]
Schomburg and Dielmann, 1973, 2
Schomburg, G.; Dielmann, G.,
Use of retention increments for identification and correlation of saturated and unsaturated cyclopropane hydrocarbons by means of Kovats indices,
Anal. Chem., 1973, 45, 9, 1647-1658, https://doi.org/10.1021/ac60331a021
. [all data]
Schomburg, 1966
Schomburg, G.,
Gaschromatographische Retentionsdaten und Struktur Chemischer Verbindungen. II. Methylverzweigungen und Doppelbindungen in Offenkettigen Kohlenwasserstoffen,
J. Chromatogr., 1966, 23, 1-17, https://doi.org/10.1016/S0021-9673(01)98652-2
. [all data]