trans-Cadinol
- Formula: C15H26O
- Molecular weight: 222.3663
- IUPAC Standard InChIKey: LHYHMMRYTDARSZ-BYNSBNAKSA-N
- Chemical structure:
View 3d structure (requires JavaScript / HTML 5) - Stereoisomers:
- 1-Naphthalenol, 1,2,3,4,4a,7,8,8a-octahydro-1,6-dimethyl-4-(1-methylethyl)-, [1R-(1α,4β,4aβ,8aβ)]-
- τ-Muurolol
- 1-Naphthalenol, 1,2,3,4,4a,7,8,8a-octahydro-1,6-dimethyl-4-(1-methylethyl)-, [1R-(1α,4β,4aβ,8aβ)]-
- α-Cadinol
- τ-Cadinol
- Amorph-4-en-10-ol
- trans-Muurolol
- 10-epi- α-cadinol
- 10-epi-α-Muurolol
- (Z)-α-Cadinol
- Cadin-4-en-10-β-ol
- amorph-4-en-10α-ol
- α-Cadinol, isomer 1
- α-Cadinol, isomer 2
- amorph-4-en-10β-ol
- Cadinol
- di-exo-T-Cadinol
- epi-α-Muurolol
- α-Muurolol
- epi-α-Cadinol
- 1-epi-Cadinol
- β-Cadin-4-en-10-ol
- α-epi-Cadinol
- trans-Muurolol
- Pilgerol
- 1-Muurolol (?)

Kovats' RI, non-polar column, temperature ramp

Column type | Active phase | I | Reference | Comment |
---|---|---|---|---|
Capillary | DB-1 | 1636. | Thangadurai, Anitha, et al., 2002 | 28. m/0.25 mm/0.25 μm, He, 50. C @ 1. min, 5.5 K/min; Tend: 270. C |

Van Den Dool and Kratz RI, non-polar column, custom temperature program

Column type | Active phase | I | Reference | Comment |
---|---|---|---|---|
Capillary | SPB-1 | 1639. | Díaz-Maroto, Sánchez Palomo, et al., 2004 | 50. m/0.25 mm/0.25 μm; Program: 70C(3min) => 4C/min => 120C => 8C/min => 250C |

Normal alkane RI, non-polar column, custom temperature program

Column type | Active phase | I | Reference | Comment |
---|---|---|---|---|
Capillary | DB-1 | 1616. | Nogueira, Marcelo-Curto, et al., 2008 | 30. m/0.25 mm/0.25 μm, He; Program: 45C => 3C/min => 175C => 15C/min => 300C (10min) |
Capillary | Methyl Silicone | 1625. | Bakshu and Raju, 2002 | Program: not specified |

References

Thangadurai, Anitha, et al., 2002
Thangadurai, D.; Anitha, S.; Pullaiah, T.; Reddy, P.N.; Ramachandraiah, O.S.,
Essential oil constituents and in vitro antimicrobial activity of Decalepis hamiltonii roots against foodborne pathogens,
J. Agric. Food Chem., 2002, 50, 11, 3147-3149, https://doi.org/10.1021/jf011541q
. [all data]
Díaz-Maroto, Sánchez Palomo, et al., 2004
Díaz-Maroto, M.C.; Sánchez Palomo, E.; Castro, L.; González Viñas, M.A.; Pérez-Coello, M.S.,
Changes produced in the aroma compounds and structural integrity of basil (Ocimum basilicum L) during drying,
J. Sci. Food Agric., 2004, 84, 15, 2070-2076, https://doi.org/10.1002/jsfa.1921
. [all data]
Nogueira, Marcelo-Curto, et al., 2008
Nogueira, T.; Marcelo-Curto, M.J.; Cristina Figueiredo, A.; Barroso, J.G.; Pedro, L.G.; Rubiolo, P.; Bicchi, C.,
Chemotaxonomy of Hypericum genus from Portugal: Geographical distribution and essential oils composition of Hypericum perfoliatum, Hypericum humifusum, Hypericum linarifolium and Hypericum pulchrum,
Biochem. Syst. Ecol., 2008, 36, 1, 40-50, https://doi.org/10.1016/j.bse.2007.07.004
. [all data]
Bakshu and Raju, 2002
Bakshu, L.Md.; Raju, R.R.V.,
Essential oil composition and antimicrobial activity of tuberous roots of Pimpinella tirupatiensis Bal. Subr., an endemic taxon from eastern ghats, India,
Flavour Fragr. J., 2002, 17, 6, 413-415, https://doi.org/10.1002/ffj.1118
. [all data]