(E)-Pinanone
- Formula: C10H16O
- Molecular weight: 152.2334
- IUPAC Standard InChIKey: MQPHVIPKLRXGDJ-RNJXMRFFSA-N
- Chemical structure:
View 3d structure (requires JavaScript / HTML 5) - Species with the same structure:
- Stereoisomers:

Normal alkane RI, non-polar column, temperature ramp

Column type | Active phase | I | Reference | Comment |
---|---|---|---|---|
Capillary | DB-5MS | 1184. | Marongiu, Porcedda, et al., 2001 | 30. m/0.25 mm/0.25 μm, He, 3. K/min, 240. C @ 30. min; Tstart: 60. C |

References

Marongiu, Porcedda, et al., 2001
Marongiu, B.; Porcedda, S.; Porta, G.D.; Reverchon, E.,
Extraction and isolation of Salvia desoleana and Mentha spicata subsp. insularis essential oils by supercritical CO2,
Flavour Fragr. J., 2001, 16, 5, 384-388, https://doi.org/10.1002/ffj.1021
. [all data]