Guaia-6,10(14)-dien-4β-ol

Normal alkane RI, non-polar column, temperature ramp

View large format table.

Column type Active phase I Reference Comment
CapillaryRTX-11605.Paolini, Tomi, et al., 200860. m/0.22 mm/0.25 μm, He, 2. K/min, 230. C @ 35. min; Tstart: 60. C
CapillaryRTX-11616.Kalemba and Thiem, 200430. m/0.25 mm/0.25 μm, N2, 4. K/min; Tstart: 60. C; Tend: 300. C
CapillaryRTX-11614.Kalemba, Marschall, et al., 200130. m/0.25 mm/0.25 μm, N2, 4. K/min; Tstart: 60. C; Tend: 300. C

Normal alkane RI, polar column, custom temperature program

View large format table.

Column type Active phase I Reference Comment
CapillaryInnowax FSC2262.Baser, Özek, et al., 200660. m/0.25 mm/0.25 μm, He; Program: 60C(10min) => 4C/min >220C (10min) => 1C/min => 240C
CapillaryInnowax FSC2262.Baser, Özek, et al., 200660. m/0.25 mm/0.25 μm, He; Program: 60C(10min) => 4C/min >220C (10min) => 1C/min => 240C
CapillaryInnowax FSC2269.Tosun, Kürkcüoglu, et al., 200660. m/0.25 mm/0.25 μm, He; Program: 60C(10min) => 4C/min => 220C (10min) => 1C/min => 240C
CapillaryHP-Innowax FSC2269.Demirci, Paper, et al., 200460. m/0.25 mm/0.25 μm, N2; Program: 60C(10min) => 4C/min => 220C(10min) => 1C/min => 240C

References

Paolini, Tomi, et al., 2008
Paolini, J.; Tomi, P.; Bernardini, A.-F.; Bradesi, P.; Casanova, J.; Kaloustian, J., Detailed analysis of the essential oil from Cistus albidus L. by combination of GC/RI, GC/MS and 13C-NMR spectroscopy, N.Z. J. Agric. Res., 2008, 22, 14, 1270-1278. [all data]

Kalemba and Thiem, 2004
Kalemba, D.; Thiem, B., Constituents of the essential oils of four micropropagated Solidago species, Flavour Fragr. J., 2004, 19, 1, 40-43, https://doi.org/10.1002/ffj.1271 . [all data]

Kalemba, Marschall, et al., 2001
Kalemba, D.; Marschall, H.; Bradesi, P., Constituents of the essential oil of Solidago gigantea Ait. (giant goldenrod), Flavour Fragr. J., 2001, 16, 1, 19-26, https://doi.org/10.1002/1099-1026(200101/02)16:1<19::AID-FFJ940>3.0.CO;2-U . [all data]

Baser, Özek, et al., 2006
Baser, K.H.C.; Özek, G.; Özek, T.; Duran, A.; Duman, H., Composition of the essential oils of Rhabdosciadium oligocarpum (Post ex Boiss.) Hedge et Lamond and Rhabdosciadium microcalycinum Hand.-Mazz., Flavour Fragr. J., 2006, 21, 4, 650-655, https://doi.org/10.1002/ffj.1639 . [all data]

Tosun, Kürkcüoglu, et al., 2006
Tosun, A.; Kürkcüoglu, M.; Dogan, E.; Duman, H.; Baser, K.H.C., Essential oil composition of Seseli petraeum M. Bieb. and Seseli andronakii Woron. growing in Turkey, Flavour Fragr. J., 2006, 21, 2, 257-259, https://doi.org/10.1002/ffj.1572 . [all data]

Demirci, Paper, et al., 2004
Demirci, F.; Paper, D.H.; Demirci, F.; Hüsnü Can Baser, K.; Franz, G., Essential oil of Betula pendula Roth. buds, eCAM, 2004, 1, 3, 301-303. [all data]