Methyl-2 decadiene-1,9
- Formula: C11H20
- Molecular weight: 152.2765
- IUPAC Standard InChIKey: ITTZSPMZRBKRGK-UHFFFAOYSA-N
- Chemical structure:
View 3d structure (requires JavaScript / HTML 5) - Other names: 1,9-Decadiene, 2-methyl

Kovats' RI, non-polar column, isothermal

Column type | Active phase | Temperature (C) | I | Reference | Comment |
---|---|---|---|---|---|
Packed | SE-30 | 150. | 1108. | Casteignau and Villessot, 1968 | Column length: 3. m |
Packed | SE-30 | 175. | 1085. | Casteignau and Villessot, 1968 | Column length: 3. m |

Kovats' RI, polar column, isothermal

Column type | Active phase | Temperature (C) | I | Reference | Comment |
---|---|---|---|---|---|
Packed | Carbowax 20M | 150. | 1253. | Casteignau and Villessot, 1968 | |
Packed | Carbowax 20M | 175. | 1236. | Casteignau and Villessot, 1968 |

Normal alkane RI, non-polar column, isothermal

Column type | Active phase | Temperature (C) | I | Reference | Comment |
---|---|---|---|---|---|
Capillary | Squalane | 70. | 1057. | Schomburg, 1966 |

References

Casteignau and Villessot, 1968
Casteignau, G.; Villessot, D.,
Identification par chromatographie en phase gaseuse de composés difonctionnels insaturés. II. Relations entre les structures et les grandeurs chromatographiques,
Bull. Soc. Chim. Fr., 1968, 9, 3904-3907. [all data]
Schomburg, 1966
Schomburg, G.,
Gaschromatographische Retentionsdaten und Struktur Chemischer Verbindungen. II. Methylverzweigungen und Doppelbindungen in Offenkettigen Kohlenwasserstoffen,
J. Chromatogr., 1966, 23, 1-17, https://doi.org/10.1016/S0021-9673(01)98652-2
. [all data]