β-Alaskene

Kovats' RI, non-polar column, isothermal

View large format table.

Column type Active phase Temperature (C) I Reference Comment
CapillaryApiezon L155.1520.5Andersen, Syrdal, et al., 1973
CapillaryApiezon L190.1539.Andersen, Syrdal, et al., 1973

Kovats' RI, polar column, isothermal

View large format table.

Column type Active phase Temperature (C) I Reference Comment
PackedCarbowax 20M165.1738.Andersen, Syrdal, et al., 1973

Normal alkane RI, non-polar column, temperature ramp

View large format table.

Column type Active phase I Reference Comment
CapillaryCP Sil 5 CB1488.Asekun and Ekundayo, 199925. m/0.25 mm/0.15 μm, H2, 3. K/min; Tstart: 50. C; Tend: 320. C

References

Andersen, Syrdal, et al., 1973
Andersen, N.H.; Syrdal, D.D.; Lawrence, B.M.; Terhune, S.J.; Hogg, J.W., Widespread occurrence of two heteroannular dienes of the cadalane skeleton, Phytochemistry, 1973, 12, 4, 827-833, https://doi.org/10.1016/0031-9422(73)80687-9 . [all data]

Asekun and Ekundayo, 1999
Asekun, O.T.; Ekundayo, O., Constituents of the leaf essential oil of Cedrela odorata L. from Nigeria, Flavour Fragr. J., 1999, 14, 6, 390-392, https://doi.org/10.1002/(SICI)1099-1026(199911/12)14:6<390::AID-FFJ850>3.0.CO;2-3 . [all data]