2-[2-(2-Isopentoxyethoxy)ethoxy]ethyl trifluoroacetate
- Formula: C13H23F3O5
- Molecular weight: 316.3139
- IUPAC Standard InChIKey: UCQNZHPFIAQFDQ-UHFFFAOYSA-N
- Chemical structure:

Van Den Dool and Kratz RI, non-polar column, temperature ramp

Column type | Active phase | I | Reference | Comment |
---|---|---|---|---|
Capillary | DB-5 | 1548. | Komárek, Richter, et al., 1998 | He, 5.5 K/min; Column length: 20. m; Column diameter: 0.25 mm; Tstart: 50. C; Tend: 350. C |

References

Komárek, Richter, et al., 1998
Komárek, K.; Richter, P.; Hoffmann, J.,
Capillary gas chromatography of n-butyl and isobutyl-, n-amyl and isoamyl polyethylene glycol ethers and their derivatives,
J. Chromatogr. A, 1998, 800, 2, 305-315, https://doi.org/10.1016/S0021-9673(97)01144-8
. [all data]