[14C1]GA60 methyl ester TMS ether
- Formula: C26H42O6Si2
- Molecular weight: 506.7791
- IUPAC Standard InChIKey: CZJKUGIUTGPWAY-GWQYXPBRSA-N
- Chemical structure:
View 3d structure (requires JavaScript / HTML 5) - Stereoisomers:
- Other names: [2H2]GA60, MeTMS; [14C]GA60, MeTMS

Kovats' RI, non-polar column, custom temperature program

Column type | Active phase | I | Reference | Comment |
---|---|---|---|---|
Capillary | DB-1 | 2576. | Emery, Pearce, et al., 2001 | He; Column diameter: 0.25 mm; Phase thickness: 0.25 μm; Program: 60C(0.1min) => 20C/min => 200C => 5C/min => 300C |

Van Den Dool and Kratz RI, non-polar column, custom temperature program

Column type | Active phase | I | Reference | Comment |
---|---|---|---|---|
Capillary | BP-1 | 2572. | MacMillan, Ward, et al., 1997 | 25. m/0.2 mm/0.1 μm, He; Program: 60C(2min) => 10C/min => 150C => 3C/min => 300C(10min) |

References

Emery, Pearce, et al., 2001
Emery, R.J.N.; Pearce, D.W.; Pharis, R.P.; Reid, D.M.; Chinnappa, C.C.,
Stem elongation and gibberellins in alpine and prairie ecotypes of Stellaria longipes,
Plant Growth Regul., 2001, 35, 1, 17-29, https://doi.org/10.1023/A:1013823517189
. [all data]
MacMillan, Ward, et al., 1997
MacMillan, J.; Ward, D.A.; Phillips, A.L.; Sánchez-Beltrán, M.J.; Gaskin, P.; Lange, T.; Hedden, P.,
Gibberellin biosynthesis from gibberellin A12-aldehyde in endosperm and embryos of Marah macrocarpus,
Plant Physiol., 1997, 113, 4, 1369-1377, https://doi.org/10.1104/pp.113.4.1369
. [all data]