[14C1]GA1 methyl ester TMS ether
- Formula: C26H42O6Si2
- Molecular weight: 506.7791
- IUPAC Standard InChIKey: UOYZRHLGPUDVGI-GJUFPDMZSA-N
- Chemical structure:
View 3d structure (requires JavaScript / HTML 5) - Species with the same structure:
- Stereoisomers:

Van Den Dool and Kratz RI, non-polar column, custom temperature program

Column type | Active phase | I | Reference | Comment |
---|---|---|---|---|
Capillary | BP-1 | 2664. | MacMillan, Ward, et al., 1997 | 25. m/0.2 mm/0.1 μm, He; Program: 60C(2min) => 10C/min => 150C => 3C/min => 300C(10min) |

References

MacMillan, Ward, et al., 1997
MacMillan, J.; Ward, D.A.; Phillips, A.L.; Sánchez-Beltrán, M.J.; Gaskin, P.; Lange, T.; Hedden, P.,
Gibberellin biosynthesis from gibberellin A12-aldehyde in endosperm and embryos of Marah macrocarpus,
Plant Physiol., 1997, 113, 4, 1369-1377, https://doi.org/10.1104/pp.113.4.1369
. [all data]