(+)-(Z)-Methyl epijasmonate
- Formula: C13H20O3
- Molecular weight: 224.2961
- IUPAC Standard InChIKey: GEWDNTWNSAZUDX-WQMVXFAESA-N
- Chemical structure:
View 3d structure (requires JavaScript / HTML 5) - Stereoisomers:
- Methyl jasmonate
- methyl epijasmonate
- Cyclopentaneacetic acid, 3-oxo-2-(2-pentenyl)-, methyl ester, [1α,2α(Z)]-
- (+)-Jasmonic acid, methyl ester (cis)
- (-)-Jasmonic acid, methyl ester (trans)
- Methyl (Z)-epi-jasmonate
- cis-Methyl jasmonate
- (E)-methyl jasmonate
- Methyl epi-jasmonate
- (Z)-Methyl epi-jasmonate
- Other names: Z-Methyl epi-jasmonoate

Normal alkane RI, non-polar column, temperature ramp

Column type | Active phase | I | Reference | Comment |
---|---|---|---|---|
Capillary | DB-5 | 1682. | Rout, Naik, et al., 2006 | 30. m/0.25 mm/0.25 μm, He, 2. K/min, 200. C @ 60. min; Tstart: 60. C |

Normal alkane RI, non-polar column, custom temperature program

Column type | Active phase | I | Reference | Comment |
---|---|---|---|---|
Capillary | RTX-1 | 1640. | ChromTech Pty Ltd, 2006 | Program: not specified |
Capillary | OV-101 | 1640. | Acree and Arn, 2004 | Program: not specified |
Capillary | OV-101 | 1640. | Acree and Arn, 1997 | Program: not specified |

References

Rout, Naik, et al., 2006
Rout, P.K.; Naik, S.N.; Rao, Y.R.,
Composition of the concrete, absolute, headspace and essential oil of the flowers of Michelia champaca Linn.,
Flavour Fragr. J., 2006, 21, 6, 906-911, https://doi.org/10.1002/ffj.1742
. [all data]
ChromTech Pty Ltd, 2006
ChromTech Pty Ltd,
Retention Data: Rtx-1, Rtx-5, Rtx-50, Rtx-Stab Kovats RI, 2006, retrieved from http://www.chromtech.net.au/pdf/RI-Flavors-20M.pdf. [all data]
Acree and Arn, 2004
Acree, T.; Arn, H.,
Flavornet, 2004, retrieved from http://www.flavornet.org/. [all data]
Acree and Arn, 1997
Acree, T.; Arn, H.,
Cornell University Flavornet, 1997, retrieved from http://www.flavornet.org/flavornet.html. [all data]