[14C] GA5 methyl ester TMS ether
- Formula: C23H32O5Si
- Molecular weight: 416.5827
- IUPAC Standard InChIKey: JKQCNZHRNGPPQX-HHBZDXFNSA-N
- Chemical structure:
View 3d structure (requires JavaScript / HTML 5) - Stereoisomers:
- Other names: 2,3-Dehydro-[14C]GA10 methyl ester TMS ether; [13C]GA5 methyl ester TMS ether

Van Den Dool and Kratz RI, non-polar column, custom temperature program

Column type | Active phase | I | Reference | Comment |
---|---|---|---|---|
Capillary | OV-1 | 2475. | Davis, Kobayashi, et al., 1999 | 25. m/0.2 mm/0.25 μm, He; Program: 60C(2min) => 10C/min => 150C => 3C/min => 300C(10min) |
Capillary | OV-1 | 2483. | Spray, Kobayashi, et al., 1996 | 25. m/0.2 mm/0.25 μm, He; Program: 60C(2min) => 10min/C => 150C => 3C/min => 300C |

References

Davis, Kobayashi, et al., 1999
Davis, G.; Kobayashi, M.; Phinney, B.O.; Lange, T.; Croker, S.J.; Gaskin, P.; MacMillan, J.,
Gibberellin biosynthesis in maize. Metabolic studies with GA15, GA24, GA25, GA7, and 2,3-dehydro-GA9,
Plant Physiol., 1999, 121, 3, 1037-1045, https://doi.org/10.1104/pp.121.3.1037
. [all data]
Spray, Kobayashi, et al., 1996
Spray, C.R.; Kobayashi, M.; Suzuki, Y.; Phinney, B.O.; Gaskin, P.; MacMillan, J.,
The dwarf-1 (dl) mutant of Zea mays blocks three steps in the gibberellin-biosynthetic pathway,
Proc. Nat. Acad. Sci. U.S.A., 1996, 93, 19, 10515-10518, https://doi.org/10.1073/pnas.93.19.10515
. [all data]