2,2',4,5'-tetrachloro-5-methyl-diphenylmethane
- Formula: C14H10Cl4
- Molecular weight: 320.041
- IUPAC Standard InChIKey: QMUKHHNFJVHXQY-UHFFFAOYSA-N
- Chemical structure:
View 3d structure (requires JavaScript / HTML 5) - Permanent link for this species. Use this link for bookmarking this species for future reference.

Kovats' RI, non-polar column, isothermal

Column type | Active phase | Temperature (C) | I | Reference | Comment |
---|---|---|---|---|---|
Capillary | DB-1 | 160.00 | 2127.5 | van Haelst, van der Wielen, et al., 1996 | 30. m/0.32 mm/0.25 μm, He |
Capillary | DB-1 | 170.00 | 2137.4 | van Haelst, van der Wielen, et al., 1996 | 30. m/0.32 mm/0.25 μm, He |

References

van Haelst, van der Wielen, et al., 1996
van Haelst, Anniek G.; van der Wielen, Frans W.M.; Govers, Harrie A.J.,
Gas chromatographic determination of liquid vapour pressure and heat of vaporization of tetrachlorobenzyltoluenes,
Journal of Chromatography A, 1996, 727, 2, 265-273, https://doi.org/10.1016/0021-9673(95)01146-3
. [all data]