GA8-2-O-β-D-glucopyranoside, permethyl

Normal alkane RI, non-polar column, temperature ramp

View large format table.

Column type Active phase I Reference Comment
CapillaryDB-13650.Schliemann, Schaller, et al., 199415. m/0.25 mm/0.25 μm, He, 60. C @ 1. min, 270. C @ 30. min
CapillaryDB-13655.Schliemann, Schaller, et al., 199415. m/0.25 mm/0.25 μm, He, 60. C @ 1. min, 270. C @ 30. min

References

Schliemann, Schaller, et al., 1994
Schliemann, W.; Schaller, B.; Jensen, E.; Schneider, G., Native gibberellin-O-glucosides from mature seeds of phaseolus coccineus, Phytochemistry, 1994, 35, 1, 35-38, https://doi.org/10.1016/S0031-9422(00)90504-1 . [all data]