[13C]GA29 methyl ester TMS ether
- Formula: C26H42O6Si2
- Molecular weight: 506.7791
- IUPAC Standard InChIKey: AINOJINHOWCGRJ-WGTPPGOWSA-N
- Chemical structure:
View 3d structure (requires JavaScript / HTML 5) - Species with the same structure:
- Stereoisomers:
- Other names: [2H2]GA29, MeTMS; [2H2] GA29, MeTMSi; [13C]endo-GA29 methyl ester TMS ether; [14C]GA29, MeTMS

Kovats' RI, non-polar column, custom temperature program

Column type | Active phase | I | Reference | Comment |
---|---|---|---|---|
Capillary | DB-1 | 2682. | Emery, Pearce, et al., 2001 | He; Column diameter: 0.25 mm; Phase thickness: 0.25 μm; Program: 60C(0.1min) => 20C/min => 200C => 5C/min => 300C |

Van Den Dool and Kratz RI, non-polar column, custom temperature program

Column type | Active phase | I | Reference | Comment |
---|---|---|---|---|
Capillary | CP Sil 5 CB | 2720. | Blake, Taylor, et al., 2002 | 25. m/0.25 mm/0.25 μm, He; Program: 60C (1min) => 20C/min => 170C => 4C/min => 290C |
Capillary | OV-1 | 2688. | Spray, Kobayashi, et al., 1996 | 25. m/0.2 mm/0.25 μm, He; Program: 60C(2min) => 10min/C => 150C => 3C/min => 300C |
Capillary | OV-1 | 2688. | Kobayashi, Gaskin, et al., 1994 | He; Column length: 25. m; Column diameter: 0.2 mm; Program: 60C(2min) => 13C/min => 150C => 3C/min => 280C(10min) |

Normal alkane RI, non-polar column, custom temperature program

Column type | Active phase | I | Reference | Comment |
---|---|---|---|---|
Capillary | SE-30 | 2680. | Wang, Little, et al., 1996 | 25. m/0.25 mm/0.25 μm; Program: 60 (2min) => 20C/min => 200C => 4C/min => 260C |
Capillary | SE-30 | 2680. | Wang, Little, et al., 1996 | 25. m/0.25 mm/0.25 μm; Program: 60 (2min) => 20C/min => 200C => 4C/min => 260C |

References

Emery, Pearce, et al., 2001
Emery, R.J.N.; Pearce, D.W.; Pharis, R.P.; Reid, D.M.; Chinnappa, C.C.,
Stem elongation and gibberellins in alpine and prairie ecotypes of Stellaria longipes,
Plant Growth Regul., 2001, 35, 1, 17-29, https://doi.org/10.1023/A:1013823517189
. [all data]
Blake, Taylor, et al., 2002
Blake, P.S.; Taylor, J.M.; Finch-Savage, W.E.,
Identification of abscisic acid, indole-3-acetic acid, jasmonic acid, indole-3-acetonitrile, methyl jasmonate and gibberellins in developing, dormant and startified seeds of ash (Fraxinus excelsior),
Plant Growth Regul., 2002, 37, 2, 119-125, https://doi.org/10.1023/A:1020504610172
. [all data]
Spray, Kobayashi, et al., 1996
Spray, C.R.; Kobayashi, M.; Suzuki, Y.; Phinney, B.O.; Gaskin, P.; MacMillan, J.,
The dwarf-1 (dl) mutant of Zea mays blocks three steps in the gibberellin-biosynthetic pathway,
Proc. Nat. Acad. Sci. U.S.A., 1996, 93, 19, 10515-10518, https://doi.org/10.1073/pnas.93.19.10515
. [all data]
Kobayashi, Gaskin, et al., 1994
Kobayashi, M.; Gaskin, P.; Spray, C.R.; Phinney, B.O.; MacMillan, J.,
The metabolism of gibberellin A20 to gibberellin A1 by tall and dwarf mutants of Oryza sativa and Arabidopsis thaliana,
Plant Physiol., 1994, 106, 1367-1372. [all data]
Wang, Little, et al., 1996
Wang, Q.; Little, C.H.A.; Moritz, T.; Odén, P.C.,
Identification of endogenous gibberellins, and metabolism of tritiated and deuterated GA4, GA9, and GA20, in Scots pine (Pinus sylvestris) shoots,
Physiol. Plant., 1996, 97, 4, 764-771, https://doi.org/10.1111/j.1399-3054.1996.tb00542.x
. [all data]