2-amino-3-hydroxy-5-chloro-benzophenone
- Formula: C13H10ClNO2
- Molecular weight: 247.677
- IUPAC Standard InChIKey: XJFFXSCDIWNOAH-UHFFFAOYSA-N
- Chemical structure:
View 3d structure (requires JavaScript / HTML 5) - Other names: Benzophenone, 2-amino-5-chloro-3-hydroxy

Kovats' RI, non-polar column, isothermal

Column type | Active phase | Temperature (C) | I | Reference | Comment |
---|---|---|---|---|---|
Packed | SE-30 | 220. | 2360. | Schütz, 1982 | N2 |
Packed | SE-30 | 280. | 2382. | Schütz, 1982 | N2 |

Normal alkane RI, non-polar column, custom temperature program

Column type | Active phase | I | Reference | Comment |
---|---|---|---|---|
Other | Methyl Silicone | 2390. | Ardrey and Moffat, 1981 | Program: not specified |

References

Schütz, 1982
Schütz, H.,
Benzodiazepines, Springer-Verlag, New York, 1982, 438. [all data]
Ardrey and Moffat, 1981
Ardrey, R.E.; Moffat, A.C.,
Gas-liquid chromatographic retention indices of 1318 substances of toxicological interest on SE-30 or OV-1 stationary phase,
J. Chromatogr., 1981, 220, 3, 195-252, https://doi.org/10.1016/S0021-9673(00)81925-1
. [all data]