(-)-Jasmonic acid, methyl ester (trans)
- Formula: C13H20O3
- Molecular weight: 224.2961
- IUPAC Standard InChIKey: GEWDNTWNSAZUDX-XXJOZFEBSA-N
- Chemical structure:
View 3d structure (requires JavaScript / HTML 5) - Species with the same structure:
- Stereoisomers:

Van Den Dool and Kratz RI, non-polar column, custom temperature program

Column type | Active phase | I | Reference | Comment |
---|---|---|---|---|
Capillary | Ultra-1 | 1605. | Schmidt, Kramell, et al., 1990 | 25. m/0.20 mm/0.11 μm; Program: 60 0C (1 min) 30 0C/min -> 180 0C 10 0C/min -> 200 0C 5 0C/min -> 270 0C |

References

Schmidt, Kramell, et al., 1990
Schmidt, J.; Kramell, R.; Brückner, C.; Schneider, G.; Sembdner, G.; Schreiber, K.; Stach, J.; Jensen, E.,
Gas chromatography/mass spectrometric and tandem mass spectrometric investigations of synthetic amino acid conjugates of jasmonic acid and endogenously occurring related compunds from Vicia faba L.,
Biomed. Environ. Mass Spectrom., 1990, 19, 5, 327-338, https://doi.org/10.1002/bms.1200190508
. [all data]