Pentacosane, 4-methyl
- Formula: C26H54
- Molecular weight: 366.7070
- IUPAC Standard InChIKey: NYSRVEXAFSYJIA-UHFFFAOYSA-N
- Chemical structure:

Kovats' RI, non-polar column, isothermal

Column type | Active phase | Temperature (C) | I | Reference | Comment |
---|---|---|---|---|---|
Capillary | Methyl Silicone | 210. | 2557. | Pomonis, Hakk, et al., 1989 | He; Column length: 12.5 m |
Capillary | Dexsil 300 | 220. | 2555. | Szafranek, Kusmierz, et al., 1982 | He; Column length: 30. m; Column diameter: 0.30 mm |

Normal alkane RI, non-polar column, temperature ramp

Column type | Active phase | I | Reference | Comment |
---|---|---|---|---|
Capillary | OV-1 | 2560.6 | Krkosova, Kubinec, et al., 2007 | 100. m/0.32 mm/0.25 μm, Helium, 5. K/min, 310. C @ 5. min; Tstart: 30. C |
Capillary | BP-1 | 2563. | Lockey and Dularay, 1986 | 25. m/0.25 mm/0.25 μm, Helium, 1.5 K/min; Tstart: 160. C; Tend: 300. C |

References

Pomonis, Hakk, et al., 1989
Pomonis, J.G.; Hakk, H.; Fatland, C.L.,
Synthetic methyl- and dimethylalkanes. Kovats indices [13C]NMR and mass spectra of some methylpentacosanes and 2,X-dimethylheptacosanes,
J. Chem. Ecol., 1989, 15, 9, 2319-2333. [all data]
Szafranek, Kusmierz, et al., 1982
Szafranek, J.; Kusmierz, J.; Czerwiec, W.,
Gas chromatographic-mass spectrometric investigations of high-boiling crude oil alkane fractions,
J. Chromatogr., 1982, 245, 2, 219-228, https://doi.org/10.1016/S0021-9673(00)88591-X
. [all data]
Krkosova, Kubinec, et al., 2007
Krkosova, Z.; Kubinec, R.; Addova, G.; Jurdakova, H.; Blasko, J.; Ostrovsky, I.; Sojak, L.,
Gas chromatographic - mass spectrometric characterization of monomethylalkanes from fuel diesel,
Petroleum Coal, 2007, 49, 3, 51-62. [all data]
Lockey and Dularay, 1986
Lockey, K.H.; Dularay, B.,
Cuticular methylalkanes of adult cockroaches, Blatta orientalis and Periplaneta Americana,
Comp. Biochem. Physiol., 1986, 85B, 3, 567-572. [all data]