13-methylpentacosane
- Formula: C26H54
- Molecular weight: 366.7070
- IUPAC Standard InChIKey: CETJMHYMIRNRRJ-UHFFFAOYSA-N
- Chemical structure:
View 3d structure (requires JavaScript / HTML 5) - Other names: Pentacosane, 13-methyl

Kovats' RI, non-polar column, isothermal

Column type | Active phase | Temperature (C) | I | Reference | Comment |
---|---|---|---|---|---|
Capillary | OV-1 | 255. | 2534. | Hebanowska, Malinski, et al., 1989 | Ar; Column length: 30. m; Phase thickness: 0.1 μm |
Capillary | Dexsil 300 | 255. | 2528. | Hebanowska, Malinski, et al., 1989 | Ar; Column length: 30. m; Phase thickness: 0.1 μm |
Capillary | Methyl Silicone | 210. | 2532. | Pomonis, Hakk, et al., 1989 | He; Column length: 12.5 m |

Van Den Dool and Kratz RI, non-polar column, temperature ramp

Column type | Active phase | I | Reference | Comment |
---|---|---|---|---|
Capillary | DB-5MS | 2533. | Steinmetz, Schmolz, et al., 2003 | 30. m/0.32 mm/0.25 μm, He, 3. K/min; Tstart: 150. C; Tend: 280. C |

Normal alkane RI, non-polar column, temperature ramp

Column type | Active phase | I | Reference | Comment |
---|---|---|---|---|
Capillary | OV-1 | 2536.5 | Krkosova, Kubinec, et al., 2007 | 100. m/0.32 mm/0.25 μm, Helium, 5. K/min, 310. C @ 5. min; Tstart: 30. C |
Capillary | Ultra-1 | 2534. | Nelson and Charlet, 2003 | He, 4. K/min; Column length: 12.5 m; Column diameter: 0.2 mm; Tstart: 150. C; Tend: 320. C |
Capillary | DB-1 | 2534. | Katritzky, Chen, et al., 2000 | 30. m/0.32 mm/0.25 μm; Tstart: 60. C; Tend: 320. C |
Capillary | OV-1 | 2534. | Hebanowska, Malinski, et al., 1990 | 2. K/min; Column length: 40. m; Column diameter: 0.25 mm; Tstart: 140. C; Tend: 300. C |
Capillary | BP-1 | 2536. | Lockey and Oraha, 1990 | 12. m/0.22 mm/0.25 μm, Helium, 2. K/min; Tstart: 100. C; Tend: 300. C |
Capillary | BP-1 | 2534. | Lockey and Dularay, 1986 | 25. m/0.25 mm/0.25 μm, Helium, 1.5 K/min; Tstart: 160. C; Tend: 300. C |
Capillary | BP-1 | 2537. | Lockey and Dularay, 1986 | 25. m/0.25 mm/0.25 μm, Helium, 1.5 K/min; Tstart: 160. C; Tend: 300. C |
Capillary | Dexsil 300 | 2535. | Lockey, 1978 | 5. K/min; Column length: 15. m; Tstart: 50. C; Tend: 370. C |

Normal alkane RI, non-polar column, custom temperature program

Column type | Active phase | I | Reference | Comment |
---|---|---|---|---|
Capillary | Polydimethyl siloxane | 2534. | Junkes, Castanho, et al., 2003 | Program: not specified |
Capillary | CP Sil 5 CB | 2535. | Kenig, Sinninghe Damsté, et al., 1995 | 25. m/0.32 mm/0.2 μm, He; Program: 50C => 20C/min => 130C => 4C/min => 300C (20min) |
Capillary | Apiezon | 2530. | Petrov, 1984 | Program: not specified |
Capillary | Dexsil 300 | 2542. | Lockey, 1981 | Column length: 15. m; Program: 50 0C 5 0C/min -> 200 0C 2 0C/min -> 340 0C |

References

Hebanowska, Malinski, et al., 1989
Hebanowska, E.; Malinski, E.; Dubis, E.; Pihlaja, K.; Oksman, P.; Winamaki, K.; Nawrot, J.; Szafranek, J.,
The composition of cuticular hydrocarbons of the Tribolium destructor,
Comp. Biochem. Physiol. B: Comp. Biochem., 1989, 93, 2, 437-442. [all data]
Pomonis, Hakk, et al., 1989
Pomonis, J.G.; Hakk, H.; Fatland, C.L.,
Synthetic methyl- and dimethylalkanes. Kovats indices [13C]NMR and mass spectra of some methylpentacosanes and 2,X-dimethylheptacosanes,
J. Chem. Ecol., 1989, 15, 9, 2319-2333. [all data]
Steinmetz, Schmolz, et al., 2003
Steinmetz, I.; Schmolz, E.; Ruther, J.,
Cuticular lipids as trail pheromone in a social wasp,
Proc. R. Soc. London B:, 2003, 270, 1513, 385-391, https://doi.org/10.1098/rspb.2002.2256
. [all data]
Krkosova, Kubinec, et al., 2007
Krkosova, Z.; Kubinec, R.; Addova, G.; Jurdakova, H.; Blasko, J.; Ostrovsky, I.; Sojak, L.,
Gas chromatographic - mass spectrometric characterization of monomethylalkanes from fuel diesel,
Petroleum Coal, 2007, 49, 3, 51-62. [all data]
Nelson and Charlet, 2003
Nelson, D.R.; Charlet, L.D.,
Cuticular hydrocarbons of the sunflower beetle,Zygogramma exclamationis,
Comp. Biochem. Physiol. B: Comp. Biochem., 2003, 135, 2, 273-284, https://doi.org/10.1016/S1096-4959(03)00080-0
. [all data]
Katritzky, Chen, et al., 2000
Katritzky, A.R.; Chen, K.; Maran, U.; Carlson, D.A.,
QSPR Correlation and predictions of GC retention indexes for methyl-branched hydrocarbons produced by insects,
Anal. Chem., 2000, 72, 1, 101-109, https://doi.org/10.1021/ac990800w
. [all data]
Hebanowska, Malinski, et al., 1990
Hebanowska, E.; Malinski, E.; Dubis, E.; Oksman, P.; Pihlaja, K.; Nawrot, J.; Szafranek, J.,
The cuticular hydrocarbons of the larvae of Anagasta kuehniella Z.,
Comp. Biochem. Physiol. B: Comp. Biochem., 1990, 95, 4, 699-703. [all data]
Lockey and Oraha, 1990
Lockey, K.H.; Oraha, V.S.,
Cuticular lipids of adult Locusta Migratoria Migratoriodes (R and F), Schstocerca Gregaria (Forskal) (Acrididae) and other orthopteran species - II. Hydrocarbons,
Comp. Biochem. Physiol., 1990, 95B, 4, 721-744. [all data]
Lockey and Dularay, 1986
Lockey, K.H.; Dularay, B.,
Cuticular methylalkanes of adult cockroaches, Blatta orientalis and Periplaneta Americana,
Comp. Biochem. Physiol., 1986, 85B, 3, 567-572. [all data]
Lockey, 1978
Lockey, K.H.,
The adult cuticular hydrocarbons of Tenebrio Molitor L. and Tenebrio Obscurus F. (Coleoptera: Tenebrionidae),
Insect Biochem., 1978, 8, 4, 237-250, https://doi.org/10.1016/0020-1790(78)90032-X
. [all data]
Junkes, Castanho, et al., 2003
Junkes, B.S.; Castanho, R.D.M.; Amboni, C.; Yunes, R.A.; Heinzen, V.E.F.,
Semiempirical Topological Index: A Novel Molecular Descriptor for Quantitative Structure-Retention Relationship Studies,
Internet Electronic Journal of Molecular Design, 2003, 2, 1, 33-49. [all data]
Kenig, Sinninghe Damsté, et al., 1995
Kenig, F.; Sinninghe Damsté, J.S.; Kock-van Dalen, A.C.; Rijpstra, W.I.C.; Huc, A.Y.; de Leeuw, J.W.,
Occurrence and origin of mono-, di-, and trimethylalkanes in modern and holocene cyanobacterial mats from Abu Dhabi, United Arab Emirates,
Geochim. Cosmochim. Acta, 1995, 59, 14, 2999-3015, https://doi.org/10.1016/0016-7037(95)00190-5
. [all data]
Petrov, 1984
Petrov, A.A.,
Hydrocarbons of petroleum, Nauka (publishing house), Moscow, 1984, 263. [all data]
Lockey, 1981
Lockey, K.H.,
Cuticular hydrocarbons of adult Cylindrinotus laevioctostriatus (Goeze) and Phylan gibbus (Fabricius) (Coleoptera: Tenebrionidae),
Insect. Biochem., 1981, 11, 5, 549-561, https://doi.org/10.1016/0020-1790(81)90023-8
. [all data]