Cyclopentane-1-carboxylic acid, 1-ethyl, methyl ester
- Formula: C9H16O2
- Molecular weight: 156.2221
- IUPAC Standard InChIKey: ADUGONOVZSGHBC-UHFFFAOYSA-N
- Chemical structure:
View 3d structure (requires JavaScript / HTML 5) - Other names: Cyclopentanecarboxylic acid, 1-ethyl, methyl ester

Kovats' RI, non-polar column, isothermal

Column type | Active phase | Temperature (C) | I | Reference | Comment |
---|---|---|---|---|---|
Packed | Squalane | 150. | 1017. | Schomburg, 1964 | |
Packed | Squalane | 150. | 1017. | Schomburg, 1964 |

References

Schomburg, 1964
Schomburg, G.,
Gas-Chromatographische Retentionsdaten und Struktur Chemischer Verbindungen. I. Verzweigte Aliphatische und Alicyclische Carbonsäure-Methylester,
J. Chromatogr., 1964, 14, 157-177, https://doi.org/10.1016/S0021-9673(00)86608-X
. [all data]