CycloHeptanethiol
- Formula: C7H14S
- Molecular weight: 130.251
- IUPAC Standard InChIKey: JRVFLEPKNRTFHN-UHFFFAOYSA-N
- Chemical structure:
View 3d structure (requires JavaScript / HTML 5) - Permanent link for this species. Use this link for bookmarking this species for future reference.

Kovats' RI, non-polar column, isothermal

Column type | Active phase | Temperature (C) | I | Reference | Comment |
---|---|---|---|---|---|
Packed | Apiezon M | 130. | 1126. | Garbuzov, Misharina, et al., 1985 | He or N2, Chromosorb W, AW-DMCS; Column length: 2.1 m |

Kovats' RI, non-polar column, custom temperature program

Column type | Active phase | I | Reference | Comment |
---|---|---|---|---|
Capillary | Apiezon M | 1126. | Zhu, Wang, et al., 2007 | Program: not specified |

Kovats' RI, polar column, custom temperature program

Column type | Active phase | I | Reference | Comment |
---|---|---|---|---|
Capillary | PEG-20M | 1427. | Zhu, Wang, et al., 2007 | Program: not specified |

References

Garbuzov, Misharina, et al., 1985
Garbuzov, V.G.; Misharina, T.A.; Aerov, A.F.; Golovnya, R.V.,
Gas chromatographic retention indices for sulphur(II)-containing organic substances,
J. Anal. Chem. USSR (Engl. Transl.), 1985, 40, 4, 576-586. [all data]
Zhu, Wang, et al., 2007
Zhu, X.H.; Wang, W.; Schramm, K.-W.; Niu, W.,
Prediction of the Kova´ ts Retention Indices of Thiols by Use of Quantum Chemical and Physicochemical Descriptors,
Chromatographia, 2007, 65, 11-12, 719-724, https://doi.org/10.1365/s10337-007-0237-3
. [all data]