Isomaltotriose, permethyl

Van Den Dool and Kratz RI, non-polar column, temperature ramp

View large format table.

Column type Active phase I Reference Comment
CapillaryDB-13227.Wang, Matsuura, et al., 198312. m/0.25 mm/0.1 μm, He, 5. K/min; Tstart: 150. C; Tend: 330. C

References

Wang, Matsuura, et al., 1983
Wang, W.-T.; Matsuura, F.; Sweeley, C.C., Chromatography of permethylated oligosaccharide alditols, Anal. Biochemistry, 1983, 134, 2, 398-405, https://doi.org/10.1016/0003-2697(83)90315-9 . [all data]