cis-8-Heptadecene
- Formula: C17H34
- Molecular weight: 238.4519
- IUPAC Standard InChIKey: BIQKRILZMDQPHI-ICFOKQHNSA-N
- Chemical structure:
View 3d structure (requires JavaScript / HTML 5) - Stereoisomers:
- Other names: (Z)-Heptadec-8-ene; (Z)-n-heptadec-8-ene; (Z)-8-Heptadecene

Kovats' RI, non-polar column, isothermal

Column type | Active phase | Temperature (C) | I | Reference | Comment |
---|---|---|---|---|---|
Capillary | Apolane | 160. | 1664.4 | Soják, Krupcík, et al., 1980 | N2 or H2; Column length: 250. m; Column diameter: 0.25 mm |
Capillary | Apiezon L | 154. | 1665.6 | Soják, Krupcík, et al., 1980 | N2 or H2; Column length: 250. m; Column diameter: 0.25 mm |

Kovats' RI, polar column, isothermal

Column type | Active phase | Temperature (C) | I | Reference | Comment |
---|---|---|---|---|---|
Capillary | PEG-20M | 110. | 1699. | Rang, Orav, et al., 1988 | |
Capillary | Carbowax 20M | 110. | 1699.2 | Soják, Krupcík, et al., 1980 | N2; Column length: 300. m; Column diameter: 0.25 mm |

Van Den Dool and Kratz RI, non-polar column, temperature ramp

Column type | Active phase | I | Reference | Comment |
---|---|---|---|---|
Capillary | CP Sil 5 CB | 1666. | Ziegenbein, Hanssen, et al., 2006 | 25. m/0.25 mm/0.4 μm, He, 10. K/min; Tstart: 80. C; Tend: 270. C |

References

Soják, Krupcík, et al., 1980
Soják, L.; Krupcík, J.; Janák, J.,
Gas chromatography of all C15-C18 linear alkenes on capillary columns with very high resolution power,
J. Chromatogr., 1980, 195, 1, 43-64, https://doi.org/10.1016/S0021-9673(00)81542-3
. [all data]
Rang, Orav, et al., 1988
Rang, S.A.; Orav, A.E.; Kuningas, K.R.; Meister, A.E.; Strense, T.V.; Eisen, O.G.,
Gas-Chromatographic Characteristics of unsaturated hydrocarbons, Academy of Sciences of Estonia SSR, Tallinn, Estonia SSR, 1988, 208. [all data]
Ziegenbein, Hanssen, et al., 2006
Ziegenbein, F.C.; Hanssen, H.-P.; König, W.A.,
Chemical constituents of the essential oils of three wood-rotting fungi,
Flavour Fragr. J., 2006, 21, 5, 813-816, https://doi.org/10.1002/ffj.1732
. [all data]