Cyclopentane, 1,1,2,4-tetramethyl
- Formula: C9H18
- Molecular weight: 126.2392
- IUPAC Standard InChIKey: AVBGIJNNMIBMQG-UHFFFAOYSA-N
- Chemical structure:
View 3d structure (requires JavaScript / HTML 5) - Species with the same structure:
- Stereoisomers:
- Other names: 1,2,2,4-Tetramethylcyclopentane

Kovats' RI, non-polar column, isothermal

Column type | Active phase | Temperature (C) | I | Reference | Comment |
---|---|---|---|---|---|
Packed | Squalane | 75. | 816. | Bogoslovsky, Anvaer, et al., 1978 |

References

Bogoslovsky, Anvaer, et al., 1978
Bogoslovsky, Yu.N.; Anvaer, B.I.; Vigdergauz, M.S.,
Chromatographic constants in gas chromatography (in Russian), Standards Publ. House, Moscow, 1978, 192. [all data]