cis-1-Butyl-2-ethylcyclopentane
- Formula: C11H22
- Molecular weight: 154.2924
- IUPAC Standard InChIKey: YJMFUCKUZMNZLY-MNOVXSKESA-N
- Chemical structure:
View 3d structure (requires JavaScript / HTML 5) - Stereoisomers:

Kovats' RI, non-polar column, isothermal

Column type | Active phase | Temperature (C) | I | Reference | Comment |
---|---|---|---|---|---|
Packed | Squalane | 100. | 1108. | Bogoslovsky, Anvaer, et al., 1978 | |
Packed | Squalane | 120. | 1118. | Bogoslovsky, Anvaer, et al., 1978 |

References

Bogoslovsky, Anvaer, et al., 1978
Bogoslovsky, Yu.N.; Anvaer, B.I.; Vigdergauz, M.S.,
Chromatographic constants in gas chromatography (in Russian), Standards Publ. House, Moscow, 1978, 192. [all data]