2,5-dimethyl-6-ethylpyridine
- Formula: C9H13N
- Molecular weight: 135.2062
- IUPAC Standard InChIKey: MGFAEPFQJNFQLD-UHFFFAOYSA-N
- Chemical structure:
View 3d structure (requires JavaScript / HTML 5) - Other names: 2-ethyl-3,6-dimethylpyridine

Kovats' RI, non-polar column, isothermal

Column type | Active phase | Temperature (C) | I | Reference | Comment |
---|---|---|---|---|---|
Packed | Apiezon L | 130. | 1084. | Shatts, Avots, et al., 1977 | He, Chromosorb W AW-DMCS; Column length: 2.4 m |

Normal alkane RI, non-polar column, temperature ramp

Column type | Active phase | I | Reference | Comment |
---|---|---|---|---|
Capillary | SE-30 | 1079.1 | Bur'yan and Nabivach, 1992 | 1.7 K/min; Tstart: 82. C; Tend: 177. C |

References

Shatts, Avots, et al., 1977
Shatts, V.D.; Avots, A.A.; Belikov, V.A.,
Retention indices of alkylpyridines,
Zh. Anal. Khim., 1977, 32, 4, 631-638. [all data]
Bur'yan and Nabivach, 1992
Bur'yan, P.; Nabivach, V.M.,
Investigation of composition of higher heterocnitrogen bases of brown coal tar,
Coke Chem. (Engl. Transl.), 1992, 5, 29-33. [all data]