1,1,3,5-Tetramethylcyclohexane
- Formula: C10H20
- Molecular weight: 140.2658
- IUPAC Standard InChIKey: WOJSMJIXPQLESQ-UHFFFAOYSA-N
- Chemical structure:
View 3d structure (requires JavaScript / HTML 5) - Stereoisomers:

Kovats' RI, non-polar column, isothermal

Column type | Active phase | Temperature (C) | I | Reference | Comment |
---|---|---|---|---|---|
Capillary | Squalane | 100. | 898.7 | Lulova, Leont'eva, et al., 1976 | He; Column length: 120. m; Column diameter: 0.25 mm |

Normal alkane RI, non-polar column, temperature ramp

Column type | Active phase | I | Reference | Comment |
---|---|---|---|---|
Capillary | Petrocol DH | 890. | Sojak, Kubinec, et al., 2006 | 150. m/0.25 mm/1.0 μm, 1. K/min; Tstart: 40. C; Tend: 300. C |

References

Lulova, Leont'eva, et al., 1976
Lulova, N.I.; Leont'eva, S.A.; Timofeeva, A.N.,
Gas-chromatographic method of determination of individual hydrocarbons in catalytic cracking gasolines
in Proceedings of All-Union Research Institute on Oil Processes. Vol.18, All-Union Research Institute on Oil Processes, Moscow, 1976, 30-53. [all data]
Sojak, Kubinec, et al., 2006
Sojak, L.; Kubinec, R.; Jurdakova, H.; Hajekova, E.; Bajus, M.,
GC-MS of polyethylene and polypropylene thermal cracking produxts,
Petroleum Coal, 2006, 48, 1, 1-14. [all data]