Silane, triethoxy-, amyloxy-
- Formula: C11H26O4Si
- Molecular weight: 250.4072
- IUPAC Standard InChIKey: KVHHJVNRKAZGMT-UHFFFAOYSA-N
- Chemical structure:
View 3d structure (requires JavaScript / HTML 5) - Permanent link for this species. Use this link for bookmarking this species for future reference.

Kovats' RI, non-polar column, isothermal

Column type | Active phase | Temperature (C) | I | Reference | Comment |
---|---|---|---|---|---|
Packed | Apiezon L | 160. | 1106. | Ellrén, Peetre, et al., 1974 | N2, Chromosorb G |

References

Ellrén, Peetre, et al., 1974
Ellrén, O.; Peetre, I.-B.; Smith, B.E.F.,
Gas chromatographic investigation of organometallic compounds and their carbon analogues. I. Determination, calculation and correlation of Kováts retention indices for tetraalkoxysilanes,
J. Chromatogr., 1974, 88, 2, 295-310, https://doi.org/10.1016/S0021-9673(00)83154-4
. [all data]