Bicyclo[3.3.0]octane-1-carboxylic acid, methyl ester
- Formula: C10H16O2
- Molecular weight: 168.2328
- IUPAC Standard InChIKey: USVBHBWDYNWYDT-UHFFFAOYSA-N
- Chemical structure:
View 3d structure (requires JavaScript / HTML 5) - Other names: Bicyclooctan[3,3,0]carboxylic acid, methyl ester

Kovats' RI, non-polar column, isothermal

Column type | Active phase | Temperature (C) | I | Reference | Comment |
---|---|---|---|---|---|
Packed | SE-30 | 140. | 1200. | Heintz, Gruselle, et al., 1976 | Chromosorb W (60-80 mesh); Column length: 2. m |
Packed | Squalane | 150. | 1151. | Schomburg, 1964 |

Kovats' RI, polar column, isothermal

Column type | Active phase | Temperature (C) | I | Reference | Comment |
---|---|---|---|---|---|
Packed | Carbowax 20M | 140. | 1544. | Heintz, Gruselle, et al., 1976 | Chromosorb W (60-80 mesh); Column length: 2. m |

References

Heintz, Gruselle, et al., 1976
Heintz, M.; Gruselle, M.; Druilhe, A.; Lefort, D.,
Relations entre structure chimique et données de rétention en chromatographie en phase gaseuse. VI. Alcools et esters méthyliques de structures cycliques,
Chromatographia, 1976, 9, 8, 367-372, https://doi.org/10.1007/BF02330385
. [all data]
Schomburg, 1964
Schomburg, G.,
Gas-Chromatographische Retentionsdaten und Struktur Chemischer Verbindungen. I. Verzweigte Aliphatische und Alicyclische Carbonsäure-Methylester,
J. Chromatogr., 1964, 14, 157-177, https://doi.org/10.1016/S0021-9673(00)86608-X
. [all data]