1,2-dimethyl-cis-2-pentyl-cyclopropane
- Formula: C10H20
- Molecular weight: 140.2658
- IUPAC Standard InChIKey: MIUGYZWCPHQTLS-ZJUUUORDSA-N
- Chemical structure:
View 3d structure (requires JavaScript / HTML 5) - Stereoisomers:

Kovats' RI, non-polar column, isothermal

Column type | Active phase | Temperature (C) | I | Reference | Comment |
---|---|---|---|---|---|
Capillary | Squalane | 100. | 934.81 | Schomburg and Dielmann, 1973 | Column length: 100. m; Column diameter: 0.25 mm |
Capillary | Squalane | 120. | 936.23 | Schomburg and Dielmann, 1973 | Column length: 100. m; Column diameter: 0.25 mm |
Capillary | Squalane | 60. | 931.4 | Schomburg and Dielmann, 1973 | Column length: 100. m; Column diameter: 0.25 mm |
Capillary | Squalane | 80. | 932.78 | Schomburg and Dielmann, 1973 | Column length: 100. m; Column diameter: 0.25 mm |

References

Schomburg and Dielmann, 1973
Schomburg, G.; Dielmann, G.,
Use of retention increments for identification and correlation of saturated and unsaturated cyclopropane hydrocarbons by means of Kovats indices,
Anal. Chem., 1973, 45, 9, 1647-1658, https://doi.org/10.1021/ac60331a021
. [all data]