Octane-1,2,3,4-d9
- Formula: C8H9D9
- Molecular weight: 123.2840
- IUPAC Standard InChIKey: TVMXDCGIABBOFY-NPNXCVMYSA-N
- Chemical structure:
View 3d structure (requires JavaScript / HTML 5) - Isotopologues:

Kovats' RI, non-polar column, isothermal

Column type | Active phase | Temperature (C) | I | Reference | Comment |
---|---|---|---|---|---|
Capillary | Squalane | 50. | 793.54 | Gäumann and Bonzo, 1973 | Column length: 100. m |

References

Gäumann and Bonzo, 1973
Gäumann, T.; Bonzo, R.,
The gas-chromatographic retention indices of deuterated compounds,
Helv. Chim. Acta, 1973, 56, 3, 1165-1176, https://doi.org/10.1002/hlca.19730560340
. [all data]