2-C2H5-Hexane-d13
- Formula: C8H5D13
- Molecular weight: 127.3086
- IUPAC Standard InChIKey: LAIUFBWHERIJIH-IVPOXXCHSA-N
- Chemical structure:
View 3d structure (requires JavaScript / HTML 5) - Isotopologues:

Kovats' RI, non-polar column, isothermal

Column type | Active phase | Temperature (C) | I | Reference | Comment |
---|---|---|---|---|---|
Capillary | Squalane | 50. | 763.71 | Gäumann and Bonzo, 1973 | Column length: 100. m |

References

Gäumann and Bonzo, 1973
Gäumann, T.; Bonzo, R.,
The gas-chromatographic retention indices of deuterated compounds,
Helv. Chim. Acta, 1973, 56, 3, 1165-1176, https://doi.org/10.1002/hlca.19730560340
. [all data]