1-trans-2-cis-3-trans-4-tetramethylcyclopentane
- Formula: C9H18
- Molecular weight: 126.2392
- IUPAC Standard InChIKey: INYXDKODFMWKER-HXFLIBJXSA-N
- Chemical structure:
View 3d structure (requires JavaScript / HTML 5) - Stereoisomers:
- 1α,2β,3α,4β-Tetramethylcyclopentane
- 1,2,3,4-Tetramethyl-cyclopentane
- 1-cis-2-trans-3-cis-4-tetramethylcyclopentane
- 1-trans-2-trans-3-cis-4-tetramethylcyclopentane
- cis,cis,cis,trans-1,2,3,4-Tetramethylcyclopentane
- cis,cis,trans,trans-1,2,3,4-Tetramethylcyclopentane
- cis,trans,cis,cis-1,2,3,4-Tetramethylcyclopentane

Kovats' RI, non-polar column, isothermal

Column type | Active phase | Temperature (C) | I | Reference | Comment |
---|---|---|---|---|---|
Capillary | Squalane | 50. | 829.4 | Lunskii and Paizanskaya, 1988 | He; Column length: 50. m; Column diameter: 0.22 mm |
Capillary | Squalane | 70. | 834.6 | Lunskii and Paizanskaya, 1988 | He; Column length: 50. m; Column diameter: 0.22 mm |

References

Lunskii and Paizanskaya, 1988
Lunskii, M.Kh.; Paizanskaya, I.L.,
Identification of hydrocarbons C1-C9 of petrol fractions of oils and condensates in the use of capillary columns with dinonylphthalate,
Zh. Anal. Khim., 1988, 43, 127-135. [all data]