α-Hydroxyarachidic acid, HFB-Me

Normal alkane RI, non-polar column, temperature ramp

Data compiled by: NIST Mass Spectrometry Data Center, William E. Wallace, director

Column type Packed
Active phase SE-30
Column length (m) 3.7
Carrier gas
Substrate Gas Chrom P
Column diameter (mm)
Phase thickness (μm)
Tstart (C) 145.
Tend (C)
Heat rate (K/min) 2.
Initial hold (min)
Final hold (min)
I 2374.
ReferenceHorning, Casparrini, et al., 1969
Comment MSDC-RI

References

Horning, Casparrini, et al., 1969
Horning, M.G.; Casparrini, G.; Horning, E.C., The use of gas phase analytical methods for the analysis of phospholipids, J. Chromatogr. Sci., 1969, 7, 5, 267-275, https://doi.org/10.1093/chromsci/7.5.267 . [all data]