Trimethyl tert.-butyl tin
- Formula: C7H18Sn
- Molecular weight: 220.928
- IUPAC Standard InChIKey: AICNKXFQZMHVJR-UHFFFAOYSA-N
- Chemical structure:
View 3d structure (requires JavaScript / HTML 5) - Species with the same structure:
- Other names: Trimethyl tertiary butyl tin

Kovats' RI, non-polar column, isothermal

Column type | Active phase | Temperature (C) | I | Reference | Comment |
---|---|---|---|---|---|
Packed | Apiezon L | 190. | 820. | Putnam and Pu, 1965 | Celite; Column length: 1. m |
Packed | Apiezon L | 190. | 820. | Putnam and Pu, 1965, 2 | Celite; Column length: 3. m |

Van Den Dool and Kratz RI, non-polar column, temperature ramp

Column type | Active phase | I | Reference | Comment |
---|---|---|---|---|
Packed | Apiezon L | 806. | Putnam and Pu, 1965, 2 | Celite, 10. K/min; Column length: 3. m; Tstart: 60. C |
Packed | Apiezon L | 809. | Putnam and Pu, 1965, 2 | Celite, 15. K/min; Column length: 3. m; Tstart: 60. C |
Packed | Apiezon L | 801. | Putnam and Pu, 1965, 2 | Celite, 6. K/min; Column length: 3. m; Tstart: 60. C |

References

Putnam and Pu, 1965
Putnam, R.C.; Pu, H.,
Retention indices of organotins,
J. Gas Chromatogr., 1965, 3, 5, 160-164, https://doi.org/10.1093/chromsci/3.5.160
. [all data]
Putnam and Pu, 1965, 2
Putnam, R.C.; Pu, H.,
Retention indices of organotins (II),
J. Gas Chromatogr., 1965, 3, 9, 289-293, https://doi.org/10.1093/chromsci/3.9.289
. [all data]