Benzene, (1-chloro-1-ethylpropyl)
- Formula: C11H15Cl
- Molecular weight: 182.690
- IUPAC Standard InChIKey: LHMUUYGTNILHKI-UHFFFAOYSA-N
- Chemical structure:
View 3d structure (requires JavaScript / HTML 5) - Permanent link for this species. Use this link for bookmarking this species for future reference.

Normal alkane RI, non-polar column, temperature ramp

Column type | Active phase | I | Reference | Comment |
---|---|---|---|---|
Capillary | OV-101 | 1259. | Zenkevich, 2001 | N2, 4. K/min; Column length: 25. m; Column diameter: 0.20 mm; Tstart: 60. C; Tend: 240. C |

References

Zenkevich, 2001
Zenkevich, I.G.,
Interpretation of Gas Chromatographic Retention Indices in estimation of Structures of Isomeric Products of Radical Chlorinating of Alkyl Arenes,
Zh. Org. Khim., 2001, 37, 2, 283-293. [all data]