β-Ionone isomer # 2
- Formula: C13H20O
- Molecular weight: 192.2973
- IUPAC Standard InChIKey: PSQYTAPXSHCGMF-BQYQJAHWSA-N
- Chemical structure:
View 3d structure (requires JavaScript / HTML 5) - Species with the same structure:

Normal alkane RI, non-polar column, temperature ramp

Column type | Active phase | I | Reference | Comment |
---|---|---|---|---|
Capillary | OV-101 | 1521. | Zenkevich, Kosman, et al., 1999 | He, 6. K/min; Column length: 25. m; Column diameter: 0.20 mm; Tstart: 80. C; Tend: 240. C |

References

Zenkevich, Kosman, et al., 1999
Zenkevich, I.G.; Kosman, V.M.; Tkachenko, K.G.,
Some Features of Quantitative Analysis of Essential Oil's Components in High Performance Liquid Chromatography,
Rastitelnye Resursy (Plant resources), 1999, 35, 1, 128-137. [all data]