(1-methylbutyl) methyl sulfide
- Formula: C6H14S
- Molecular weight: 118.240
- IUPAC Standard InChIKey: WGBHWWSSUGCSCP-UHFFFAOYSA-N
- Chemical structure:
View 3d structure (requires JavaScript / HTML 5) - Species with the same structure:
- Other names: Methyl (1-methylbutyl) sulfide

Normal alkane RI, non-polar column, custom temperature program

Column type | Active phase | I | Reference | Comment |
---|---|---|---|---|
Capillary | Methyl Silicone | 868. | Zenkevich, 1999 | Program: not specified |

References

Zenkevich, 1999
Zenkevich, I.G.,
Dependence of Gas Chromatographic Retention Indices on Dynamics Molecular Characteristics,
Zh. Fiz. Khim., 1999, 73, 5, 905-910. [all data]