Ethyl 1,1-difluoro-2,2-dichloroethyl ether
- Formula: C4H6Cl2F2O
- Molecular weight: 178.993
- IUPAC Standard InChIKey: RVZBQBQBQKUNLU-UHFFFAOYSA-N
- Chemical structure:
View 3d structure (requires JavaScript / HTML 5) - Other names: Ethyl 2,2-dichloro-1,1-difluoroethyl ether

Normal alkane RI, non-polar column, custom temperature program

Column type | Active phase | I | Reference | Comment |
---|---|---|---|---|
Capillary | Methyl Silicone | 769. | Zenkevich, 1999 | Program: not specified |
Capillary | Polydimethyl siloxanes | 769. | Zenkevich, 1997 | Program: not specified |

References

Zenkevich, 1999
Zenkevich, I.G.,
New Application of the Retention Index Concept in Gas and High Performance Liquid Chromatography,
Fresenius' J. Anal. Chem., 1999, 365, 4, 305-309, https://doi.org/10.1007/s002160051491
. [all data]
Zenkevich, 1997
Zenkevich, I.G.,
Influence of the Variations of Dynamics Molecular Parameterts on the Additivity of Chromatigraphic Retention Indices of Products of Organic Reactions Relative to Initial Reagents,
Dokl. Akad. Nauk (Rus.), 1997, 353, 5, 625-627. [all data]