epi-α-Bisabolol, acetate
- Formula: C17H28O2
- Molecular weight: 264.4030
- IUPAC Standard InChIKey: RQYNNIWGGJJGDH-SJORKVTESA-N
- Chemical structure:
View 3d structure (requires JavaScript / HTML 5) - Stereoisomers:

Normal alkane RI, non-polar column, custom temperature program

Column type | Active phase | I | Reference | Comment |
---|---|---|---|---|
Capillary | SE-30 | 1791. | Vinogradov, 2004 | Program: not specified |
Capillary | Methyl Silicone | 1791. | Zenkevich, 1999 | Program: not specified |

References

Vinogradov, 2004
Vinogradov, B.A.,
Production, composition, properties and application of essential oils, 2004, retrieved from http://viness.narod.ru. [all data]
Zenkevich, 1999
Zenkevich, I.G.,
Analytical Parameters of Components of essential Oils for their Gas Chromatographic and Chromato-Mass-Spectral Identification. Acetates of Terpene Alcohols,
Rastitelnye Resursy (Plant Resources), 1999, 35, 1, 30-37. [all data]