Benzene, 1-(1-chloroethyl)-4-methyl
- Formula: C9H11Cl
- Molecular weight: 154.637
- IUPAC Standard InChIKey: WQLQKKZHEUQVBU-UHFFFAOYSA-N
- Chemical structure:
View 3d structure (requires JavaScript / HTML 5) - Permanent link for this species. Use this link for bookmarking this species for future reference.

Normal alkane RI, non-polar column, custom temperature program

Column type | Active phase | I | Reference | Comment |
---|---|---|---|---|
Capillary | Methyl Silicone | 1149. | Zenkevich, 1999 | Program: not specified |

References

Zenkevich, 1999
Zenkevich, I.G.,
Mutual Correlation between Gas-Chromatographic Retention Indices of Organic Compounds from Different Series,
Zh. Anal. Khim., 1999, 54, 12, 1272-1279. [all data]