Diazene, ethyl-(2-methylpropyl)
- Formula: C6H14N2
- Molecular weight: 114.1888
- IUPAC Standard InChIKey: XTJYPGLPPGVKTM-UHFFFAOYSA-N
- Chemical structure:
View 3d structure (requires JavaScript / HTML 5) - Other names: trans-ethyl-i-butyl-diazene

Kovats' RI, non-polar column, isothermal

Column type | Active phase | Temperature (C) | I | Reference | Comment |
---|---|---|---|---|---|
Capillary | Methyl Silicone | 50. | 731.7 | Görgényi, Fekete, et al., 1989 | 50. m/0.32 mm/1. μm, N2 |

Normal alkane RI, non-polar column, custom temperature program

Column type | Active phase | I | Reference | Comment |
---|---|---|---|---|
Capillary | Methyl Silicone | 725. | Zenkevich, 1999 | Program: not specified |

References

Görgényi, Fekete, et al., 1989
Görgényi, M.; Fekete, Z.; Seres, L.,
Estimation and prediction of the retention indices of selected trans-diazenes,
Chromatographia, 1989, 27, 11/12, 581-584, https://doi.org/10.1007/BF02258982
. [all data]
Zenkevich, 1999
Zenkevich, I.G.,
Precalculation of Gas Chromatographic Retention Indices of Organic Compounds from Boiling Points of their Structural Analogues,
Zh. Struct. Khim., 1999, 40, 1, 121-130. [all data]