Diazene, bis-(1-methylpropyl)
- Formula: C8H18N2
- Molecular weight: 142.2419
- IUPAC Standard InChIKey: GRXNCUZPWWIDKG-UHFFFAOYSA-N
- Chemical structure:
View 3d structure (requires JavaScript / HTML 5) - Species with the same structure:

Normal alkane RI, non-polar column, custom temperature program

Column type | Active phase | I | Reference | Comment |
---|---|---|---|---|
Capillary | Methyl Silicone | 846. | Zenkevich, 1999 | Program: not specified |

References

Zenkevich, 1999
Zenkevich, I.G.,
Precalculation of Gas Chromatographic Retention Indices of Organic Compounds from Boiling Points of their Structural Analogues,
Zh. Struct. Khim., 1999, 40, 1, 121-130. [all data]