1-Butanamine, N,N,3-trimethyl
- Formula: C7H17N
- Molecular weight: 115.2166
- IUPAC Standard InChIKey: KOOQJINBDNZUTB-UHFFFAOYSA-N
- Chemical structure:
View 3d structure (requires JavaScript / HTML 5) - Species with the same structure:
- Other names: Dimethylisoamylamine

Kovats' RI, non-polar column, isothermal

Column type | Active phase | Temperature (C) | I | Reference | Comment |
---|---|---|---|---|---|
Packed | Apiezon | 100. | 754. | Golovnya, Zhuravleva, et al., 1976 | Column length: 2.7 m |

References

Golovnya, Zhuravleva, et al., 1976
Golovnya, R.V.; Zhuravleva, I.L.; Kapustin, Yu.P.,
Gas chromatographic separation of tertiary isoaliphatic amines on supports treated with trisodium phosphate,
Zh. Anal. Khim., 1976, 31, 764-768. [all data]